CANADA
type: Concept

CA/STATSCAN/AS/SK
type: Concept
definition: The following Info-Guide is a document designed to help you navigate through the federal and provincial government programs and services available to Aboriginal people starting or operating a business in Saskatchewan. Although many of your questions will be answered in this document, this list is, by no means, exhaustive. Further information on any of these programs or services can be obtained by calling the numbers listed under the program descriptions; visiting the Web sites listed under the program descriptions; by calling the Canada-Saskatchewan Business Service Centre (CSBSC) and speaking with one of our Information Officers; by visiting the CSBSC office in person; or by visiting the Canada-Saskatchewan Business Service Centre Web site. http://www.canadabusiness.ca/servlet/ContentServer?pagename=CBSC_SK/display&c=GuideInfoGuide&cid=1102419630828&lang=en
in scheme: providers