USDA
type: Concept

USDA/ARS/SWRC
type: Concept
change note: 2016-11-15 11:21:13.0 [gee-cee] update Definition (The USDA Southwest Watershed Research Center has a mission to to understand and model the effects of changing climate, land use, and management practices on the hydrologic cycle, soil erosion processes, and watershed resources; to develop remote sensing technology and apply geospatial analysis techniques; to develop decision support tools for natural resource management; and to develop new technology to assess and predict the condition and sustainability of rangeland watersheds. Website: "https://www.ars.usda.gov/pacific-west-area/pendleton/swcr/" [Summary provided by the USDA>]);
definition: The USDA Southwest Watershed Research Center has a mission to to understand and model the effects of changing climate, land use, and management practices on the hydrologic cycle, soil erosion processes, and watershed resources; to develop remote sensing technology and apply geospatial analysis techniques; to develop decision support tools for natural resource management; and to develop new technology to assess and predict the condition and sustainability of rangeland watersheds. Website: "https://www.ars.usda.gov/pacific-west-area/pendleton/swcr/" [Summary provided by the USDA>]
in scheme: providers