CONSORTIA/INSTITUTIONS
type: Concept

IEO/CEDO
type: Concept
definition: The Spanish Oceanographic Data Centre is a small unit of the Spanish Oceanographic Institute responsible for compiling, storing and distributing data produced by the different research areas of the Institute. Contact: Centro Espanol de Datos Oceanograficos Instituto Espanol de Oceanografia Avda. de Brasil, No 31. 28020 Madrid Espana Tel: 5974443 Tlx: 44460 Fax: 5974770
in scheme: providers