FREEZE/FROST
type: Concept

LAST FREEZE/FROST DATE
type: Concept
change note: 2016-07-15 11:19:11.0 [saritz] Move Concepts delete broader relation (null); add broader relation (LAST FREEZE/FROST DATE [fc768468-62d4-40fa-8880-a773a855a496,217705] - FREEZE/FREE PERIOD LENGTH [5a0347ba-2684-4c4a-adc0-ddb63cbbde6b,217711]);
change note: 2016-07-15 11:19:20.0 [saritz] Move Concepts delete broader relation (null); add broader relation (LAST FREEZE/FROST DATE [fc768468-62d4-40fa-8880-a773a855a496,217705] - FREEZE/FROST1 [4539272a-f041-4fc6-883d-4c4c5bef1683,85025]);
change note: 2016-06-28 13:44:37.0 [saritz] Insert Concept add broader relation (LAST FREEZE/FROST DATE [fc768468-62d4-40fa-8880-a773a855a496,217705] - FREEZE/FROST [5be5caa4-9f86-47ff-a08f-fb1eb97918b5,217701]);
change note: 2016-06-28 13:45:17.0 [saritz] insert Definition (id: null text: Last frost was based on the last occurrence of 36°F or lower temperature, last freeze was based on the flast occurrence of 32°F temperature. language code: en);
definition: Last frost was based on the last occurrence of 36°F or lower temperature, last freeze was based on the flast occurrence of 32°F temperature.
in scheme: sciencekeywords