ACADEMIC
type: Concept

SLU/EAS
type: Concept
definition: Saint Louis University is a Jesuit, Catholic university ranked among the top research institutions in the nation. The University fosters the intellectual and character development of more than 12,300 students. Founded in 1818, it is the oldest university west of the Mississippi and the second oldest Jesuit university in the United States. Through teaching, research, health care and community service, Saint Louis University has provided one-of-a-kind education, leadership and service for 190 years. Summary Provided By: http://www.slu.edu/x5029.xml
in scheme: providers