CRYOSPHERIC INDICATORS
type: Concept

RIVER ICE DEPTH/EXTENT
type: Concept
change note: 2012-07-10 15:25:01.0 [mpmorahan] insert Definition (id: null text: Pertaining to the extent, thickness, longevity, etc. of ice formations that occur on river systems. language code: en);
change note: 2012-06-26 13:36:48.0 [gee-cee] Insert Concept add broader relation (RIVER ICE DEPTH/EXTENT [fde8a54a-8aaa-45fd-bb66-3105e4c57102,39931] - CRYOSPHERIC INDICATORS [76b8c21c-c221-4724-86ef-c07222cb152b,39899]);
definition: Pertaining to the extent, thickness, longevity, etc. of ice formations that occur on river systems.
in scheme: sciencekeywords