Earth Observation Satellites
type: Concept

HY2-A
type: Concept
alternative label: Ocean-2A
change note: 2018-08-10 14:50:40.0 [sritz] insert AltLabel (id: null category: null text: Ocean-2A language code: en);
change note: 2018-08-10 14:48:57.0 [sritz] insert AltLabel (id: null category: primary text: Haiyang-2A language code: en); insert Definition (id: null text: HY-2 is a second generation ocean observation/monitoring satellite series approved by CNSA (China National Space Administration) Beijing in Feb. 2007. The HY-2A mission represents a follow-up of the HY-1A and HY-1B missions. The overall objective of HY-2 is the measurement of ocean dynamic and environmental parameters in the microwave region (i.e., all weather observations). The requirements call also for the collection of data on marine wind setup (wind vector), marine surface height, and SST (Sea Surface Temperature), along with aero-marine forecasts for the prevention and relief of disaster. language code: en);
change note: 2018-08-10 14:47:59.0 [sritz] Insert Concept add broader relation (HY2-A [fe07a2e4-a6cd-401c-af3e-433bbc8c2c98,368063] - Earth Observation Satellites [3466eed1-2fbb-49bf-ab0b-dc08731d502b,344761]);
definition: HY-2 is a second generation ocean observation/monitoring satellite series approved by CNSA (China National Space Administration) Beijing in Feb. 2007. The HY-2A mission represents a follow-up of the HY-1A and HY-1B missions. The overall objective of HY-2 is the measurement of ocean dynamic and environmental parameters in the microwave region (i.e., all weather observations). The requirements call also for the collection of data on marine wind setup (wind vector), marine surface height, and SST (Sea Surface Temperature), along with aero-marine forecasts for the prevention and relief of disaster.
in scheme: platforms