LAND USE/LAND COVER
type: Concept

LAND USE CLASSES
type: Concept
change note: 2013-08-16 09:15:42.0 [tbs1979] update Definition (Remote Sensing and Image Interpretation, John Wiley & Sons, 1994. ); update Definition (Categories defining the land in some way, such as by slope, land cover, and type);
definition: Categories defining the land in some way, such as by slope, land cover, and type
in scheme: sciencekeywords