PALEOCLIMATE RECONSTRUCTIONS
type: Concept

SOLAR FORCING/INSOLATION RECONSTRUCTION
type: Concept
change note: 2012-07-26 12:12:04.0 [mpmorahan] insert Definition (id: null text: Reconstruction of past solar forcing and insolation based on paleoclimate proxy records. language code: en);
change note: 2012-06-27 08:52:44.0 [mpmorahan] Insert Concept add broader relation (SOLAR FORCING/INSOLATION RECONSTRUCTION [fec6c2e4-ca15-426a-b344-36bba69e5c1f,40171] - PALEOCLIMATE RECONSTRUCTIONS [6f6423e8-ab4e-4572-8982-d9c40f64e28b,40149]);
definition: Reconstruction of past solar forcing and insolation based on paleoclimate proxy records.
in scheme: sciencekeywords