GOVERNMENT AGENCIES-U.S. FEDERAL AGENCIES
type: Concept

HUD
type: Concept
definition: HUD's mission is to increase home ownership, support community development and increase access to affordable housing free from discrimination. To fulfill this mission, HUD will embrace high standards of ethics, management and accountability and forge new partnerships--particularly with faith-based and community organizations--that leverage resources and improve HUD's ability to be effective on the community level. [Summary provided by HUD]
in scheme: providers