Worldview
type: Concept

WORLDVIEW-2
type: Concept
change note: 2021-11-30 09:44:01.0 [tstevens] Move Concepts delete broader relation (null); add broader relation (WORLDVIEW-2 [ff0ed18d-c476-4dc4-a248-d42ad74bb4a1,826944] - Earth Observation Satellites [3466eed1-2fbb-49bf-ab0b-dc08731d502b,826121]);
change note: 2021-11-30 09:44:58.0 [tstevens] Move Concepts delete broader relation (null); add broader relation (WORLDVIEW-2 [ff0ed18d-c476-4dc4-a248-d42ad74bb4a1,826944] - WORLDVIEW [45694b28-c8a0-4a89-affc-082282ae9db0,835905]);
change note: 2021-11-18 12:38:50.0 [tstevens] Move Concepts delete broader relation (null); add broader relation (WORLDVIEW-2 [ff0ed18d-c476-4dc4-a248-d42ad74bb4a1,826944] - Space-based Platforms [b39a69b4-c3b9-4a94-b296-bbbbe5e4c847,835875]);
change note: 2013-05-07 15:00:54.0 [aaleman] Insert Concept add broader relation (WORLDVIEW-2 [ff0ed18d-c476-4dc4-a248-d42ad74bb4a1,105099] - Earth Observation Satellites [3466eed1-2fbb-49bf-ab0b-dc08731d502b,73425]);
change note: 2019-02-22 17:05:06.0 [mmorahan] insert WeightedRelation (id: null related concept uuid: 001d8e8c-e9b1-4418-9941-f41321c2c500 relationship type: null relationship value: null generated by: null);
change note: 2020-10-07 11:35:40.0 [mmorahan] insert AltLabel (id: null category: primary text: DigitalGlobe WORLDVIEW-2 language code: en);
change note: 2013-05-07 15:05:56.0 [aaleman] added new platform insert Definition (id: null text: WorldView-2, launched October 2009, is the first high-resolution 8-band multispectral commercial satellite. Operating at an altitude of 770 kilometers, WorldView-2 provides 46 cm panchromatic resolution and 1.85 meter* multispectral resolution. WorldView-2 has an average revisit time of 1.1 days and is capable of collecting up to 1 million square kilometers of 8-band imagery per day, greatly enhancing the DigitalGlobe multispectral collection capacity for more rapid and reliable collection. The WorldView-2 system, offering incredible accuracy, agility, capacity and spectral diversity, allows DigitalGlobe to substantially expand its imagery product offerings to both commercial and government customers. language code: en);
definition: WorldView-2, launched October 2009, is the first high-resolution 8-band multispectral commercial satellite. Operating at an altitude of 770 kilometers, WorldView-2 provides 46 cm panchromatic resolution and 1.85 meter* multispectral resolution. WorldView-2 has an average revisit time of 1.1 days and is capable of collecting up to 1 million square kilometers of 8-band imagery per day, greatly enhancing the DigitalGlobe multispectral collection capacity for more rapid and reliable collection. The WorldView-2 system, offering incredible accuracy, agility, capacity and spectral diversity, allows DigitalGlobe to substantially expand its imagery product offerings to both commercial and government customers. Group: Platform_Details Entry_ID: WORLDVIEW-2 Group: Platform_Identification Platform_Category: Earth Observation Satellites Short_Name: WORLDVIEW-2 End_Group Group: Orbit Orbit_Altitude: 770 km Equator_Crossing: 10:30 am Local time: e.g. Period: 100 min Repeat_Cycle: 101 days at 1 meter GSD or less; 3.7 days at 20deg off-nadir or less (0.52 meter GSD) Orbit_Type: LEO > LOW EARTH ORBIT > POLAR SUN-SYNCHRONOUS End_Group Creation_Date: 2013-05-08 Online_Resource: http://www.digitalglobe.com/about-us/content-collection#satellites&worldview-2 Group: Platform_Logistics Launch_Date: 2009-10-08 Launch_Site: VANDENBERG AIR FORCE BASE, USA Design_Life: 10-12 years Primary_Sponsor: DigitalGlobe End_Group End_Group
in scheme: platforms