USDA
type: Concept

USDA/ARS/SPRRS
type: Concept
definition: The USDA Southern Plains Range Research Station conducts agricultural research and and studies for the southern plains region. Various research includes grazing management, forage management, ecosystem studies, grassland forages, and management of improved forage grass and legume species and grass-legume interactions. Website: "http://www.sprrs.usda.gov/"
in scheme: providers