CANADA
type: Concept

CA/NRCAN/ESS/GC/CCRS/GEO/ATLAS
type: Concept
change note: 2015-02-25 16:26:12.0 [epneff] Updated URL update Definition (The Atlas of Canada provides authoritative, current and accessible geographic information products at a national level. Working with partners, the Atlas facilitates the integration and analysis of diverse data in order to increase overall knowledge about Canada. The Atlas of Canada Web site will provide the most interesting, dynamic and comprehensive collection of maps and related information about Canada available anywhere on the Internet, with effective and intuitive tools for users to access them. Website: http://atlas.nrcan.gc.ca/site/english/ [Summary provided by Natural Resources Canada, Earth Sciences Sector, The Atlas of Canada]);
definition: The Atlas of Canada provides authoritative, current and accessible geographic information products at a national level. Working with partners, the Atlas facilitates the integration and analysis of diverse data in order to increase overall knowledge about Canada. The Atlas of Canada Web site will provide the most interesting, dynamic and comprehensive collection of maps and related information about Canada available anywhere on the Internet, with effective and intuitive tools for users to access them. http://atlas.nrcan.gc.ca/site/english/ [Summary provided by Natural Resources Canada, Earth Sciences Sector, The Atlas of Canada]
in scheme: providers