Orbital anomalies
type: Concept
narrower: Mean anomaly

Mean anomaly
type: Concept
contributor: AAS Frey.Katie
broader: Orbital anomalies
definition: The angle between the periapsis of an orbit and the position of a hypothetical body that orbits in the same period as the real one but at a constant mean angular velocity.
modified: 2020-11-10T19:21:54.127Z
modified: 2020-11-10T19:21:32.851Z