Micrometeorites
type: Concept
contributor: AAS Frey.Katie Admin
broader: Meteorites
definition: A small grain sized meteorite which can only be positively identified under the microscope.
modified: 2020-11-03T18:53:46.901Z
modified: 2020-11-03T18:53:32.725Z

Meteorites
type: Concept
narrower: Micrometeorites