Chemical abundances
type: Concept
narrower: Abundance ratios

Abundance ratios
type: Concept
contributor: AAS Frey.Katie
broader: Chemical abundances
definition: The relative amount of a given chemical element with respect to other elements.
modified: 2020-11-02T17:18:57.522Z
modified: 2020-11-02T17:18:26.234Z