Ocean planets
type: Concept
contributor: AAS Frey.Katie Admin
alternative label: Water worlds
broader: Exoplanets
definition: A hypothetical exoplanet covered by a water envelope. The presence of such a planet stems from the implicit assumption of Habitable Zone temperatures and a liquid water surface.
modified: 2020-11-03T19:54:01.11Z
modified: 2020-11-03T19:53:47.154Z

Exoplanets
type: Concept
narrower: Ocean planets