Stellar populations
type: Concept
narrower: Population I stars

Population I stars
type: Concept
alternative label: Pop I
alternative label: Population 1 stars
alternative label: Population one stars
modified: 2020-11-03T20:28:01.041Z
modified: 2020-11-03T20:28:15.966Z
scope note: Young, metal-rich stars commonly found in the spiral arms of the Milky Way galaxy
broader: Stellar populations
contributor: AAS Frey.Katie Admin
definition: A member of a class of relatively young stars, containing a large fraction of metals, found mainly in the disk of the Galaxy.