Population II stars
type: Concept
narrower: Population II Cepheid variable stars
alternative label: Population 2 stars
alternative label: Population two stars
alternative label: Pop II
definition: A member of a population of relatively old stars, containing a small fraction of metals, found mainly in the halo of the Galaxy and in globular clusters.
broader: Stellar populations
modified: 2020-11-03T20:28:46.299Z
modified: 2020-12-16T19:02:18.945Z
contributor: AAS Frey.Katie Admin

Population II Cepheid variable stars
type: Concept
broader: Population II stars

Stellar populations
type: Concept
narrower: Population II stars