Proton-proton reaction
type: Concept
alternative label: Proton proton reaction
alternative label: Proton proton cycle
alternative label: Proton-proton cycle
modified: 2020-11-17T19:54:41.701Z
modified: 2020-11-17T19:54:52.864Z
broader: Hydrogen burning
contributor: AAS Frey.Katie
definition: A thermonuclear reaction in which two protons collide at very high velocities and combine to form a deuterium.

Hydrogen burning
type: Concept
narrower: Proton-proton reaction