Pulsar planets
type: Concept
contributor: AAS Frey.Katie Admin
broader: Exoplanets
definition: A planet orbiting a pulsar. The first such planet to be discovered was around a millisecond pulsar known as PSR 1257+12.
modified: 2020-11-03T20:42:34.464Z
modified: 2020-11-03T20:42:19.6Z

Exoplanets
type: Concept
narrower: Pulsar planets