Quasars
type: Concept
narrower: Radio loud quasars

Radio loud quasars
type: Concept
contributor: AAS Frey.Katie Admin
alternative label: Radio-loud quasars
broader: Quasars
definition: A quasar that has the same characteristics as a radio-quiet quasar with the addition of having strong radio emissions.
modified: 2020-11-03T21:03:25.967Z
modified: 2020-11-03T21:03:14.19Z