Barium stars
type: Concept
contributor: AAS Frey.Katie Admin
alternative label: Ba II stars
definition: A type of star, usually G or K giants, whose spectra show unusually strong absorption lines of barium, strontium, and other s-process elements.
narrower: Semi-barium stars
broader: Heavy metal stars
modified: 2020-11-04T14:41:59.578Z
modified: 2020-11-04T14:42:12.192Z

Semi-barium stars
type: Concept
broader: Barium stars

Heavy metal stars
type: Concept
narrower: Barium stars