Interstellar extinction
type: Concept
narrower: Reddened stars

Reddened stars
type: Concept
contributor: AAS Frey.Katie Admin
broader: Interstellar extinction
definition: A star whose light has undergone reddening.
modified: 2020-11-03T21:22:18.093Z
modified: 2020-11-03T21:21:57.359Z