Short period comets
type: Concept
modified: 2020-11-04T14:52:21.698Z
modified: 2020-11-04T14:52:35.833Z
broader: Comets
alternative label: Short-period comet
alternative label: Periodic comets
definition: A comet with a period less than 200 years.
contributor: AAS Frey.Katie Admin

Comets
type: Concept
narrower: Short period comets