Slow novae
type: Concept
contributor: AAS Frey.Katie Admin
alternative label: Novoid
broader: Novae
definition: A type of nova whose light curve exhibits a characteristically slow development, having a rise time of several days, maximum of several weeks, and slower decline.
modified: 2020-11-04T14:57:04.386Z
modified: 2020-11-04T14:56:53.169Z

Novae
type: Concept
narrower: Slow novae