Star formation
type: Concept
narrower: Star forming regions

Star forming regions
type: Concept
definition: A region in the interstellar medium where processes of star formation are going on or have occurred in the past.
created: 2016-11-02T13:48:20Z
broader: Star formation
modified: 2020-11-04T16:42:35.183Z
modified: 2020-11-04T16:42:46.647Z
creator: AAS Frey.Katie
alternative label: Star formation regions
contributor: AAS Frey.Katie Admin