Stellar dynamics
type: Concept
contributor: AAS Frey.Katie
contributor: AAS Frey.Katie Admin
narrower: Supernova dynamics
modified: 2020-11-19T16:15:46.715Z
modified: 2020-12-17T16:39:52.829Z
broader: Stellar physics
definition: The field of astrophysics that describes systems of many point mass particles whose mutual gravitational interactions determine their orbits. These systems include star clusters, globular clusters, and galaxies. Stellar dynamics deals with systems in which each member contributes importantly to the overall gravitational field and is usually concerned with the statistical properties of many orbits. It can be compared to the kinetic theory of gases developed in the late 19th century. In contrast, celestial mechanics deals with systems where the gravitational force of a massive planet or star determines the orbits of its satellites.

Supernova dynamics
type: Concept
broader: Stellar dynamics

Stellar physics
type: Concept
narrower: Stellar dynamics