Stellar photometry
type: Concept
contributor: AAS Frey.Katie
broader: Photometry
definition: The precise measurement of a star's brightness, usually through several specific wavelength bands.
modified: 2020-11-19T16:20:07.484Z
modified: 2020-11-19T16:19:57.632Z

Photometry
type: Concept
narrower: Stellar photometry