Radio astronomy
type: Concept
narrower: Submillimeter astronomy

Submillimeter astronomy
type: Concept
contributor: AAS Frey.Katie
contributor: AAS Frey.Katie Admin
preferred label: Submillimetre astronomy
modified: 2021-08-24T15:42:39.943Z
modified: 2020-11-19T16:24:28.378Z
definition: The study of astronomical objects with submillimeter waves. As with millimeter-wave astronomy, this part of the spectrum is rich in lines emitted by interstellar molecules and dust.
broader: Radio astronomy