Blueshifted
type: Concept
alternative label: Blue shift
alternative label: Blueshift
definition: The apparent shift of the wavelength towards the shorter wavelength region of the radiation spectrum of an approaching object due to the Doppler effect.
contributor: AAS Frey.Katie Admin
modified: 2020-11-04T20:46:37.113Z
modified: 2020-11-04T20:46:50.24Z
broader: Doppler shift

Doppler shift
type: Concept
narrower: Blueshifted