Total eclipses
type: Concept
contributor: AAS Frey.Katie Admin
broader: Eclipses
definition: An eclipse in which the whole of the disk of the Sun or Moon is obscured.
modified: 2020-11-04T19:55:52.311Z
modified: 2020-11-04T19:55:40.013Z

Eclipses
type: Concept
narrower: Total eclipses