Binary stars
type: Concept
narrower: Wide binary stars

Wide binary stars
type: Concept
contributor: AAS Frey.Katie Admin
broader: Binary stars
definition: A binary system with semi-major axis as large as 10,000 astronomical units.
modified: 2020-11-04T21:09:57.836Z
modified: 2020-11-04T21:09:47.096Z