Stellar types
type: Concept
narrower: Low mass stars

Low mass stars
type: Concept
alternative label: Low-mass star
definition: A star whose mass is around that of the Sun.
contributor: AAS Frey.Katie Admin
creator: AAS Frey.Katie Admin
modified: 2020-11-03T16:45:34.843Z
modified: 2020-11-03T16:45:49.673Z
broader: Stellar types
created: 2018-09-13T15:44:49Z