Plasma physics
type: Concept
created: 2018-09-13T20:04:00Z
contributor: AAS Frey.Katie
broader: Laboratory astrophysics
creator: AAS Frey.Katie Admin
modified: 2020-11-17T19:36:02.584Z
modified: 2020-11-17T19:36:12.57Z
related: Plasma astrophysics
definition: The study of the physical properties of the various forms of plasmas and their processing.

Laboratory astrophysics
type: Concept
narrower: Plasma physics

Plasma astrophysics
type: Concept
related: Plasma physics