Pulsating variable stars
type: Concept
narrower: Blue large-amplitude pulsators

Blue large-amplitude pulsators
type: Concept
alternative label: BLAPs
alternative label: Blue large-amplitude pulsating stars
alternative label: BLAP
contributor: AAS Frey.Katie Admin
creator: AAS Frey.Katie
modified: 2020-11-24T16:58:18.932Z
scope note: A class of pulsating variable stars with short periods. These stars are hot (hence "blue" in name) and show relatively large amplitudes. The evolutionary state of these stars is not known. -- https://github.com/astrothesaurus/UAT/issues/286
created: 2019-12-02T16:57:15.144Z
broader: Pulsating variable stars