Centre of mass
type: Concept
broader: Orbital elements
alternative label: Center of gravity
definition: A fixed point in a body through which the resultant force of gravitational attraction acts.
preferred label: Center of mass
modified: 2021-08-24T15:25:06.254Z
modified: 2020-11-03T19:05:13.699Z
contributor: AAS Frey.Katie
contributor: AAS Frey.Katie Admin

Orbital elements
type: Concept
narrower: Centre of mass