Exoplanet dynamics
type: Concept
narrower: Star-planet interactions

Solar-planetary interactions
type: Concept
related: Star-planet interactions

Star-planet interactions
type: Concept
scope note: Interactions between exoplanets and their stars. The similar concept "Solar-planetary interactions" is specific to interactions between the Sun and Solar system planets.
related: Solar-planetary interactions
broader: Exoplanet dynamics
alternative label: Stellar-planetary interactions
alternative label: Star-exoplanet interactions
contributor: AAS Frey.Katie Admin
creator: AAS Frey.Katie Admin
created: 2020-11-12T21:46:34.266Z
modified: 2020-11-12T21:50:19.03Z