Astronomical techniques
type: Concept
narrower: Remote sensing

Remote sensing
type: Concept
creator: AAS Frey.Katie Admin
scope note: Intended to cover planetary remote sensing, a "catch-all term for any planetary work using remote observations. It would include radar, but also VNIR, TIR, etc. wavelengths."
created: 2020-12-04T16:06:16.832Z
modified: 2020-12-04T16:22:55.352Z
modified: 2020-12-04T16:10:55.006Z
broader: Astronomical techniques
contributor: AAS Frey.Katie Admin
definition: Technique that utilizes electromagnetic waves to detect, measure, and obtain information about an object that is not in contact with the sensing apparatus.
related: Planetary science

Planetary science
type: Concept
related: Remote sensing