Lightning
type: Concept
creator: AAS Frey.Katie Admin
broader: Planetary atmospheres
definition: A flash of light produced by an electric discharge in response to the buildup of an electric potential between clouds and a planet's surface, or between different portions of the same cloud.
modified: 2020-12-04T16:36:56.927Z
modified: 2020-12-04T16:37:18.774Z
created: 2020-12-04T16:36:13.469Z
contributor: AAS Frey.Katie Admin

Planetary atmospheres
type: Concept
narrower: Lightning