Kreutz group
type: Concept
broader: Sungrazers

Near-sun comets
type: Concept
narrower: Sungrazers

Sungrazers
type: Concept
created: 2020-12-04T18:44:50.31Z
definition: Objects that reach perihelion within 3.45 solar radii, i.e. the fluid Roche limit.
modified: 2022-01-04T22:32:05.593Z
modified: 2020-12-04T18:47:40.579Z
creator: AAS Frey.Katie Admin
narrower: Kreutz group
broader: Near-sun comets
contributor: AAS Frey.Katie Admin