Closed universe
type: Concept
contributor: AAS Frey.Katie
broader: Cosmological models
definition: A cosmological model, first formulated by Friedmann and Lemaître, in which the Universe has a finite size and lifetime and space has a positive curvature, e.g. a Universe with a density greater than the critical density.
modified: 2020-11-03T19:25:23.855Z
modified: 2020-11-03T19:25:11.726Z

Cosmological models
type: Concept
narrower: Closed universe