Atmospheric clouds
type: Concept
narrower: Earth's clouds

Earth's clouds
type: Concept
broader: Earth atmosphere
broader: Atmospheric clouds
modified: 2020-12-16T19:54:05.427Z
modified: 2020-10-26T20:07:30.473Z
contributor: AAS Frey.Katie
contributor: AAS Frey.Katie Admin
definition: A visible mass of water droplets and/or ice particles in the atmosphere above the Earth's surface.
alternative label: Clouds

Earth atmosphere
type: Concept
narrower: Earth's clouds