Binary stars
type: Concept
narrower: Detached binary stars

Detached binary stars
type: Concept
contributor: AAS Frey.Katie
broader: Binary stars
definition: A binary star system whose components are not in contact and in which no significant mass exchange is occurring.
modified: 2020-10-27T13:37:20.041Z
modified: 2020-10-27T13:37:04.501Z