Dredge-up
type: Concept
contributor: AAS Frey.Katie
alternative label: Dredge up
broader: Late stellar evolution
definition: A process by which the nucleosynthesis products inside a star are drawn to upper layers of the star.
modified: 2020-11-03T20:21:01.947Z
modified: 2020-11-03T20:20:50.881Z

Late stellar evolution
type: Concept
narrower: Dredge-up