Cosmic inflation
type: Concept
narrower: E-folding time

E-folding time
type: Concept
contributor: AAS Frey.Katie
broader: Cosmic inflation
definition: The time within which the amplitude of an oscillation increases or decreases by a factor e (= 2.71828...).
modified: 2020-11-03T20:46:47.16Z
modified: 2020-11-03T20:46:28.061Z