Ecliptic coordinate system
type: Concept
narrower: Ecliptic latitude

Ecliptic latitude
type: Concept
contributor: AAS Frey.Katie
broader: Ecliptic coordinate system
definition: One of the two coordinates in the ecliptic system; the angle measured from the ecliptic, positive toward the north.
modified: 2020-11-03T20:38:41.446Z
modified: 2020-11-03T20:38:29.461Z