Ecliptic coordinate system
type: Concept
narrower: Ecliptic longitude

Ecliptic longitude
type: Concept
contributor: AAS Frey.Katie
broader: Ecliptic coordinate system
definition: One of the two coordinates in the ecliptic system; the angle measured eastwards along the ecliptic from 0° to 360°, with the origin at the vernal equinox.
modified: 2020-11-03T20:42:15.552Z
modified: 2020-11-03T20:42:04.985Z