Effective temperature
type: Concept
contributor: AAS Frey.Katie
broader: Astrometry
definition: A measure of the surface temperature of a star derived from the total emitted energy, assuming that the star is a blackbody emitter.
modified: 2020-11-03T20:43:19.177Z
modified: 2020-11-03T20:43:09.848Z

Astrometry
type: Concept
narrower: Effective temperature