Cosmological models
type: Concept
narrower: Einstein universe

Einstein universe
type: Concept
contributor: AAS Frey.Katie
alternative label: Einstein static Universe
broader: Cosmological models
definition: A cosmological model in which a static (neither expanding nor collapsing) Universe is maintained by introducing a cosmological repulsion force (in the form of the cosmological constant) to counterbalance the gravitational force.
modified: 2020-10-30T19:22:31.112Z
modified: 2020-10-30T19:22:18.674Z